{"text_format":"1","workbook":"xlsx","n_sheets":4,"sheets":["ORDEN TRABAJO","LISTADO","DATOS","Hoja2"],"not_rendered":{"charts":0,"images":0,"macros":1,"external_links":0,"defined_names":6,"comments":0,"pivot_tables":0},"unopened":[],"bounds":{"document_bytes":16777216,"sheet_cells":100000,"rows_first":2000,"rows_last":500,"rows_between":2000,"halvings":0,"cell_chars":16384,"cell_head_chars":4096},"cells_cut":0,"cells_raw":0,"read":"whole","date_system":"1900"}

{"sheet":"ORDEN TRABAJO","index":0,"n_rows":37,"n_cols":8,"rows_kept":37,"cut":false,"hidden":false,"merged":[[1,0,1,2],[6,0,6,7],[35,4,35,7],[32,1,32,3],[18,0,18,7],[31,1,31,3],[24,0,24,7],[21,0,21,7],[26,1,26,3],[34,1,34,2],[26,4,26,5],[27,4,27,5],[14,3,14,4],[14,6,15,7],[28,4,28,5],[30,4,30,5],[36,1,36,2],[31,4,31,5],[32,4,32,5],[34,4,34,5],[35,1,35,2],[27,1,27,3],[28,1,28,3],[29,1,29,3],[30,1,30,3],[9,3,9,4],[10,3,10,4],[11,3,11,4],[12,3,12,4],[29,4,29,5]]}
["ORDEN DE TRABAJO MAQUINARIA"]
[]
[]
[]
[]
[]
["ORDEN DE TRABAJO"]
[]
["Nº ORDEN",{"$f":"COUNT(LISTADO!A5:A1048576)+1","v":2}]
["FECHA/HORA  ORDEN",null,{"$f":"NOW()","v":43515.509834027776},"MECÁNICA",null,null,"ACEITES     "]
["VEHICULO",null,{"$f":"IF(B11=0,\" - \",INDIRECT(\"DATOS!B\"&MATCH(B11,DATOS!A:A,0)))","v":" - "},"MAQUINARIA",null,null,"NEUMÁTICA"]
["MARCA/MODELO",{"$f":"IF(B11=0,\" - \",INDIRECT(\"DATOS!C\"&MATCH(B11,DATOS!A:A,0)))","v":" - "},null,"RUEDAS",null,null,"REFRIGERANTE"]
["TIPO DE AVERIA",null,null,"ELECTRICIDAD",null,null,"OTROS"]
["CODIGO VEHICULO",{"$f":"IF(B11=0,\" - \",INDIRECT(\"DATOS!D\"&MATCH(B11,DATOS!A:A,0)))","v":" - "},null,null,"CARROCERÍA"]
["KILOMETROS",null,null,"SISTEMA HIDRAULICO"]
["HOROMETRO"]
[]
[]
["DESCRIPCION AVERIA"]
[]
[]
["REPARACIONES EFECTUADAS"]
[]
[]
["MATERIAL EMPLEADO"]
[]
["REFERENCIA","DESCRIPCION",null,null,"CANT.",null,null,"NUMERO ALBARAN"]
[]
[]
[]
[]
[]
[]
[]
["OPERARIO",null,null,null,"FECHA FINAL"]
["FIRMA",null,null,null,"VISTO Bº RESPONSABLE"]
["HORAS EMPLEADAS"]

{"sheet":"LISTADO","index":1,"n_rows":6,"n_cols":10,"rows_kept":6,"cut":false,"hidden":false,"merged":[]}
[]
[null,null,null,"VEHICULOS Y MAQUINARIA PENDIENTES DE REPARACION"]
[null,null,null,null,"FECHA:",{"$f":"TODAY()","v":"2019-02-19"}]
[]
["Nº ORDEN","FECHA","MATRICULA","MARCA/MODELO","TIPO AVERIA","DESCRIPCION","FECHA REPARACION","REP.","DESCRIPCION REPARACION","MECANICO"]
[1,"2019-02-04","3126JXR","RENAULT D18 280E6","CHAPA/EXTERIOR","ESPEJO RETROVISOR FLOJO","2019-02-11","SI"]

{"sheet":"DATOS","index":2,"n_rows":99,"n_cols":4,"rows_kept":99,"cut":false,"hidden":false,"merged":[]}
["MATRICULA","TIPO","MARCA/MODELO","CODIGO"]
["0241JTX","LATERAL RSU","RENAULT D26 WIDE 320E6","FRL-01"]
["0871JST","HIDROLIMPIADOR","RENAULT MASTER","FHD-02"]
["0939JST","HIDROLIMPIADOR","RENAULT MASTER","FHD-04"]
["0976JST","HIDROLIMPIADOR","RENAULT MASTER","FHD-03"]
["1030JST","FURGON","RENAULT MASTER","FVA-11"]
["1077JST","HIDROLIMPIADOR","RENAULT MASTER","FHD-05"]
["1133JST","LIMPIEZA VIARIA","PIAGGIO PORTER","FVB-01"]
["1156JST","LIMPIEZA VIARIA","PIAGGIO PORTER","FVB-02"]
["1185JST","LIMPIEZA VIARIA","PIAGGIO PORTER","FVB-03"]
["1702JST","LIMPIEZA VIARIA","PIAGGIO PORTER","FVB-04"]
["1923JTX","LATERAL RSU","RENAULT D26 WIDE 320E6","FRL-02"]
["2119JTX","LATERAL RSU","RENAULT D26 WIDE 320E6","FRL-03"]
["3136JXR","CUBA BALDEO","RENAULT D18 280E5","FCB-01"]
["3174JXR","CUBA BALDEO","RENAULT D18 280E6","FCB-03"]
["3207JXR","CUBA BALDEO","RENAULT D18 280E7","FCB-04"]
["3126JXR","CUBA BALDEO","RENAULT D18 280E6","FCB-05"]
["3235JXR","CUBA BALDEO","RENAULT D18 280E6","FCB-06"]
["3337JXR","CUBA BALDEO","RENAULT D18 280E6","FCB-02"]
["4407JVJ","TRASERA RSU","RENAULT D18 280E6","FRT-01"]
["4939JSH","HIDROLIMPIADOR","RENAULT MASTER","FHD-01"]
["5575GCX","BRIGADA","RENAULT MAXITY","FBR-01"]
["5605JWS","TRASERA RSU","RENAULT D18 280E6","FRT-05"]
["7006FCY","FURGON TALLER","CITROEN JUMPER","FHD-11"]
["7178DZX","HIDROLIMPIADOR","CITROEN JUMPER","FVA-12"]
["7200JWH","TRASERA RSU","RENAULT D18 280E6","FRT-04"]
["7723DZT","FURGONETA","RENAULT KANGOO","FVA-11"]
["7733GDH","LATERAL RSU","RENAULT 320 26","FRL-11"]
["8096JVJ","TRASERA RSU","RENAULT D26 WIDE 320E6","FRT-02"]
["8099JVJ","TRASERA RSU","RENAULT D18 280E6","FRT-03"]
["8112BXF","CUBA BALDEO","IVECO","FCB-07"]
["8298JPS","FURGONETA","RENAULT KANGOO","FVD-03"]
["8831JYX","BRIGADA","FUSO CANTER 7 C15 - HEV","FBR-02"]
["9031JWG","LAVAVONT. TRASERO","RENAULT D16","FLV-02"]
["9231JWG","AMPLIROLL","RENAULT","FBR-04"]
["9537JSW","LIMPIEZA VIARIA","PIAGGIO PORTER","FVB-00"]
["9563JSW","LIMPIEZA VIARIA","PIAGGIO PORTER","FVB-05"]
["9686JSW","LIMPIEZA VIARIA","PIAGGIO PORTER","FVB-06"]
["9696GCW","PAVITA","RENAULT MAXITY 130 35","FMT-12"]
["9696JXJ","FURGONETA","RENAULT KANGOO","FVD-04"]
["9794JSW","LIMPIEZA VIARIA","PIAGGIO PORTER","FVB-07"]
["9829JSW","LIMPIEZA VIARIA","PIAGGIO PORTER","FVB-08"]
["9861JSW","LIMPIEZA VIARIA","PIAGGIO PORTER","FVB-09"]
["9869JYX","BRIGADA","MITSUBISHI - FUSO","FBR-03"]
["9879JSW","LIMPIEZA VIARIA","PIAGGIO PORTER","FVB-10"]
["9910JVL","LAVAVONT. LATERAL","RENAULT D18 280E6","FLV-01"]
["E0699BGP","BARREDORA","BUCHER CITY CAT 5006","FBA-01"]
["E0702BGP","BARREDORA","BUCHER -CITY CAT 5005","FBA-02"]
["E0712BGP","BARREDORA","BUCHER -CITY CAT 5006","FBA-03"]
["E2068BGR","BARREDORA","HAKO WERKE CITY MASTER","FBA-04"]
["M9061W","TRASERA RSU","RENAULT 260 18","FRT-13"]
["SOPLADOR_1","SOPLADOR","STHILL","FVS-01"]
["SOPLADOR_2","SOPLADOR","STHILL","FVS-02"]
["SOPLADOR_3","SOPLADOR","STHILL","FVS-03"]
["SOPLADOR_4","SOPLADOR","STHILL","FVS-04"]
["SOPLADOR_5","SOPLADOR","STHILL","FVS-05"]
["SOPLADOR_6","SOPLADOR","STHILL","FVS-06"]
["SOPLADOR_7","SOPLADOR","STHILL","FVS-07"]
["TRICICLO 1","LIMPIEZA VIARIA","TRICICLO ELECTRICO","FVT-01"]
["TRICICLO 2","LIMPIEZA VIARIA","TRICICLO ELECTRICO","FVT-02"]
["TRICICLO 3","LIMPIEZA VIARIA","TRICICLO ELECTRICO","FVT-03"]
["TRICICLO 4","LIMPIEZA VIARIA","TRICICLO ELECTRICO","FVT-04"]
["TRICICLO 5","LIMPIEZA VIARIA","TRICICLO ELECTRICO","FVT-05"]
["TRICICLO 6","LIMPIEZA VIARIA","TRICICLO ELECTRICO","FVT-06"]
["TRICICLO 7","LIMPIEZA VIARIA","TRICICLO ELECTRICO","FVT-07"]
["TRICICLO 8","LIMPIEZA VIARIA","TRICICLO ELECTRICO","FVT-08"]
["TRICICLO 9","LIMPIEZA VIARIA","TRICICLO ELECTRICO","FVT-09"]
["TRICICLO 10","LIMPIEZA VIARIA","TRICICLO ELECTRICO","FVT-10"]
["TRICICLO 11","LIMPIEZA VIARIA","TRICICLO ELECTRICO","FVT-11"]
["TRICICLO 12","LIMPIEZA VIARIA","TRICICLO ELECTRICO","FVT-12"]
["TRICICLO 13","LIMPIEZA VIARIA","TRICICLO ELECTRICO","FVT-13"]
["TRICICLO 14","LIMPIEZA VIARIA","TRICICLO ELECTRICO","FVT-14"]
["TRICICLO 15","LIMPIEZA VIARIA","TRICICLO ELECTRICO","FVT-15"]
["TRICICLO 16","LIMPIEZA VIARIA","TRICICLO ELECTRICO","FVT-16"]
["TRICICLO 17","LIMPIEZA VIARIA","TRICICLO ELECTRICO","FVT-17"]
["TRICICLO 18","LIMPIEZA VIARIA","TRICICLO ELECTRICO","FVT-18"]
["TRICICLO 19","LIMPIEZA VIARIA","TRICICLO ELECTRICO","FVT-19"]
["TRICICLO 20","LIMPIEZA VIARIA","TRICICLO ELECTRICO","FVT-20"]
["CORTAFILOS","LIMPIEZA VIARIA","STHILL","FVF-01"]
["CARRO 1","LIMPIEZA VIARIA","CARRO DE MANO","FVC-01"]
["CARRO 2","LIMPIEZA VIARIA","CARRO DE MANO","FVC-02"]
["CARRO 3","LIMPIEZA VIARIA","CARRO DE MANO","FVC-03"]
["CARRO 4","LIMPIEZA VIARIA","CARRO DE MANO","FVC-04"]
["CARRO 5","LIMPIEZA VIARIA","CARRO DE MANO","FVC-05"]
["CARRO 6","LIMPIEZA VIARIA","CARRO DE MANO","FVC-06"]
["CARRO 7","LIMPIEZA VIARIA","CARRO DE MANO","FVC-07"]
["CARRO 8","LIMPIEZA VIARIA","CARRO DE MANO","FVC-08"]
["CARRO 9","LIMPIEZA VIARIA","CARRO DE MANO","FVC-09"]
["CARRO 10","LIMPIEZA VIARIA","CARRO DE MANO","FVC-10"]
["CARRO 11","LIMPIEZA VIARIA","CARRO DE MANO","FVC-11"]
["CARRO 12","LIMPIEZA VIARIA","CARRO DE MANO","FVC-12"]
["CARRO 13","LIMPIEZA VIARIA","CARRO DE MANO","FVC-13"]
["CARRO 14","LIMPIEZA VIARIA","CARRO DE MANO","FVC-14"]
["CARRO 15","LIMPIEZA VIARIA","CARRO DE MANO","FVC-15"]
["CARRO 16","LIMPIEZA VIARIA","CARRO DE MANO","FVC-16"]
["CARRO 17","LIMPIEZA VIARIA","CARRO DE MANO","FVC-17"]
["CARRO 18","LIMPIEZA VIARIA","CARRO DE MANO","FVC-18"]
["CARRO 19","LIMPIEZA VIARIA","CARRO DE MANO","FVC-19"]
["CARRO 20","LIMPIEZA VIARIA","CARRO DE MANO","FVC-20"]

{"sheet":"Hoja2","index":3,"n_rows":13,"n_cols":2,"rows_kept":13,"cut":false,"hidden":false,"merged":[]}
[]
[null,"MECÁNICA"]
[null,"MOTOR AUXILIAR"]
[null,"PROGRAMACION"]
[null,"NEUMATICOS"]
[null,"ELECTRICIDAD"]
[null,"CHAPA/EXTERIOR"]
[null,"SISTEMA HIDRAULICO"]
[null,"ACEITES"]
[null,"HIDRAULICO"]
[null,"REFRIGERANTE"]
[null,"CEPILLOS"]
[null,"OTROS"]