{"text_format":"1","workbook":"xlsx","n_sheets":4,"sheets":["EXISTENCIAS","MOVIMIENTOS","R-SALIDAS","DATOS"],"not_rendered":{"charts":0,"images":1,"macros":1,"external_links":0,"defined_names":0,"comments":0,"pivot_tables":0},"unopened":[],"bounds":{"document_bytes":16777216,"sheet_cells":100000,"rows_first":2000,"rows_last":500,"rows_between":2000,"halvings":0,"cell_chars":16384,"cell_head_chars":4096},"cells_cut":0,"cells_raw":0,"read":"whole","date_system":"1900"}

{"sheet":"EXISTENCIAS","index":0,"n_rows":1179,"n_cols":7,"rows_kept":1179,"cut":false,"hidden":false,"merged":[]}
[]
[]
[]
[null,"CODIGO","DATOS X","DATOS X","DATOS X","DATOS X","STOCK"]
[null,1,null,null,null,null,2]
[null,2,null,null,null,null,28]
[null,3,null,null,null,null,0]
[null,4,null,null,null,null,0]
[null,5,null,null,null,null,24]
[null,6,null,null,null,null,50]
[null,7,null,null,null,null,0]
[null,8,null,null,null,null,47]
[null,9,null,null,null,null,42]
[null,10,null,null,null,null,34]
[null,11,null,null,null,null,50]
[null,12,null,null,null,null,0]
[null,13,null,null,null,null,72]
[null,14,null,null,null,null,47]
[null,15,null,null,null,null,162]
[null,16,null,null,null,null,99]
[null,17,null,null,null,null,1]
[null,18,null,null,null,null,118]
[null,19,null,null,null,null,86]
[null,20,null,null,null,null,114]
[null,21,null,null,null,null,114]
[null,22,null,null,null,null,137]
[null,23,null,null,null,null,115]
[null,24,null,null,null,null,118]
[null,25,null,null,null,null,101]
[null,26,null,null,null,null,133]
[null,27,null,null,null,null,124]
[null,28,null,null,null,null,158]
[null,29,null,null,null,null,146]
[null,30,null,null,null,null,109]
[null,31,null,null,null,null,62]
[null,32,null,null,null,null,62]
[null,33,null,null,null,null,92]
[null,34,null,null,null,null,34]
[null,35,null,null,null,null,58]
[null,36,null,null,null,null,31]
[null,37,null,null,null,null,29]
[null,38,null,null,null,null,37]
[null,39,null,null,null,null,110]
[null,40,null,null,null,null,23]
[null,41,null,null,null,null,1]
[null,42,null,null,null,null,52]
[null,43,null,null,null,null,42]
[null,44,null,null,null,null,60]
[null,45,null,null,null,null,42]
[null,46,null,null,null,null,49]
[null,47,null,null,null,null,30]
[null,48,null,null,null,null,21]
[null,49,null,null,null,null,51]
[null,50,null,null,null,null,39]
[null,51,null,null,null,null,30]
[null,52,null,null,null,null,28]
[null,53,null,null,null,null,30]
[null,54,null,null,null,null,32]
[null,55,null,null,null,null,69]
[null,56,null,null,null,null,65]
[null,57,null,null,null,null,118]
[null,58,null,null,null,null,7]
[null,59,null,null,null,null,25]
[null,60,null,null,null,null,63]
[null,61,null,null,null,null,6]
[null,62,null,null,null,null,17]
[null,63,null,null,null,null,7]
[null,64,null,null,null,null,30]
[null,65,null,null,null,null,11]
[null,66,null,null,null,null,13]
[null,67,null,null,null,null,16]
[null,68,null,null,null,null,15]
[null,69,null,null,null,null,6]
[null,70,null,null,null,null,31]
[null,71,null,null,null,null,0]
[null,72,null,null,null,null,0]
[null,73,null,null,null,null,51]
[null,74,null,null,null,null,0]
[null,75,null,null,null,null,0]
[null,76,null,null,null,null,0]
[null,77,null,null,null,null,0]
[null,78,null,null,null,null,0]
[null,79,null,null,null,null,0]
[null,80,null,null,null,null,0]
[null,81,null,null,null,null,0]
[null,82,null,null,null,null,23]
[null,83,null,null,null,null,10]
[null,84,null,null,null,null,0]
[null,85,null,null,null,null,6]
[null,86,null,null,null,null,0]
[null,87,null,null,null,null,0]
[null,88,null,null,null,null,14]
[null,89,null,null,null,null,16]
[null,90,null,null,null,null,10]
[null,91,null,null,null,null,24]
[null,92,null,null,null,null,0]
[null,93,null,null,null,null,8]
[null,94,null,null,null,null,0]
[null,95,null,null,null,null,26]
[null,96,null,null,null,null,17]
[null,97,null,null,null,null,0]
[null,98,null,null,null,null,26]
[null,99,null,null,null,null,11]
[null,100,null,null,null,null,23]
[null,101,null,null,null,null,47]
[null,102,null,null,null,null,53]
[null,103,null,null,null,null,46]
[null,104,null,null,null,null,34]
[null,105,null,null,null,null,20]
[null,106,null,null,null,null,49]
[null,107,null,null,null,null,19]
[null,108,null,null,null,null,29]
[null,109,null,null,null,null,6]
[null,110,null,null,null,null,0]
[null,111,null,null,null,null,80]
[null,112,null,null,null,null,78]
[null,113,null,null,null,null,71]
[null,114,null,null,null,null,0]
[null,115,null,null,null,null,17]
[null,116,null,null,null,null,25]
{"$rows_left_out":1060}
{"sheet":"MOVIMIENTOS","index":1,"n_rows":46,"n_cols":7,"rows_kept":46,"cut":false,"hidden":false,"merged":[]}
[null,"CODIGO","ARTICULO","FECHA","INGRESO ","SALIDA","STOCK"]
[null,"0049-A-65","DATOS X","2017-03-27","DATOS X",1,"DATOS X"]
[null,"0096-B-32","DATOS X","2017-03-27","DATOS X",2,"DATOS X"]
[null,"0103-B-39","DATOS X","2017-03-28","DATOS X",3,"DATOS X"]
[null,"0110-B-46","DATOS X","2017-03-29","DATOS X",4,"DATOS X"]
[null,"0111-B-47","DATOS X","2017-03-30","DATOS X",5,"DATOS X"]
[null,"0119-B-55","DATOS X","2017-03-31","DATOS X",6,"DATOS X"]
[null,"0119-B-56","DATOS X","2017-04-01","DATOS X",6,"DATOS X"]
[null,"0119-B-57","DATOS X","2017-04-02","DATOS X",6,"DATOS X"]
[null,"0119-B-58","DATOS X","2017-04-03","DATOS X",6,"DATOS X"]
[null,"0119-B-59","DATOS X","2017-04-04","DATOS X",6,"DATOS X"]
[null,"0119-B-60","DATOS X","2017-04-05","DATOS X",6,"DATOS X"]
[null,"0119-B-61","DATOS X","2017-04-06","DATOS X",6,"DATOS X"]
[null,"0119-B-62","DATOS X","2017-04-07","DATOS X",6,"DATOS X"]
[null,"0119-B-63","DATOS X","2017-04-08","DATOS X",6,"DATOS X"]
[null,"0119-B-64","DATOS X","2017-04-09","DATOS X",6,"DATOS X"]
[null,"0119-B-65","DATOS X","2017-04-10","DATOS X",6,"DATOS X"]
[null,"0119-B-66","DATOS X","2017-04-11","DATOS X",6,"DATOS X"]
[null,"0119-B-67","DATOS X","2017-04-12","DATOS X",6,"DATOS X"]
[null,"0119-B-68","DATOS X","2017-04-13","DATOS X",6,"DATOS X"]
[null,"0119-B-69","DATOS X","2017-04-14","DATOS X",6,"DATOS X"]
[null,"0119-B-70","DATOS X","2017-04-15","DATOS X",6,"DATOS X"]
[null,"0119-B-71","DATOS X","2017-04-16","DATOS X",6,"DATOS X"]
[null,"0119-B-72","DATOS X","2017-04-17","DATOS X",6,"DATOS X"]
[null,"0005-A-21","DATOS X","2017-04-18",null,20,"DATOS X"]
[null,"0006-A-22","DATOS X","2017-04-19",null,50,"DATOS X"]
[null,"0005-A-21","DATOS X","2017-04-20",null,1,"DATOS X"]
[null,"0001-A-16","DATOS X","2017-04-21",null,2,"DATOS X"]
[null,"0003-A-19","DATOS X","2017-04-22",null,1200,"DATOS X"]
[null,"0007-A-23","DATOS X","2017-04-23",null,500,"DATOS X"]
[null,"0014-A-30","DATOS X","2017-04-24",null,5000,"DATOS X"]
[null,"0913-7PK-1640","DATOS X","2017-04-25",null,646556,"DATOS X"]
[null,"0005-A-21","DATOS X","2017-04-26",null,2500,"DATOS X"]
[null,"0002-A-17","DATOS X","2017-04-27",null,4500,"DATOS X"]
[null,"0001-A-16","DATOS X","2017-04-28",null,5000,"DATOS X"]
[null,"0003-A-19","DATOS X","2017-04-29",null,1200,"DATOS X"]
[null,"0007-A-23","DATOS X","2017-04-30",null,646565,"DATOS X"]
[null,"0013-A-29","DATOS X","2017-05-01",null,5000,"DATOS X"]
[null,"0003-A-19","DATOS X","2017-05-02",null,1500,"DATOS X"]
[null,"0006-A-22","DATOS X","2017-05-03",null,45000,"DATOS X"]
[null,"0006-A-22","DATOS X","2017-05-04",null,500,"DATOS X"]
[null,"0330-RPF-2290","DATOS X","2017-05-05",null,5000,"DATOS X"]
[null,"0002-A-17","DATOS X","2017-05-06",null,12,"DATOS X"]
[null,"0004-A-20","DATOS X","2017-05-07",null,500,"DATOS X"]
[null,"0008-A-24","DATOS X","2017-05-08",null,600,"DATOS X"]
[null,"0002-A-17","DATOS X","2017-05-09",null,1.2,"DATOS X"]

{"sheet":"R-SALIDAS","index":2,"n_rows":52,"n_cols":12,"rows_kept":52,"cut":false,"hidden":false,"merged":[[3,11,14,14],[20,11,21,17]]}
[null,"CLIENTE","FECHA","CODIGO","ARTICULO","SALIDA","OPERACIÓN"]
[null,"CLIENTE 1","DATOS X","2017-03-27",null,1,"DATOS X"]
[null,"CLIENTE 2","DATOS X","2017-03-27",null,2,"DATOS X"]
[null,"CLIENTE 3","DATOS X","2017-03-28",null,3,"DATOS X",null,null,null,null,"DISCULPEN LA MOLESTIA, QUISERA EN MI AGREGAR (ASI COMO TENGO EN MI FORMULARIO UN LABEL TOTAL) UNA FORMA DE PODER VER EL STOCK DEL CODIGO . CUANDO SELECCIONO O SE VEA. BUENO SOLO POR AHORA QUISIERA QUE SE MUESTRE . COMO PRUEBA PARA PODER MAS ADELANTE AGREGARLE O MEJORARLO AUN MAS MI MODESTO INVENTARIO. GRACIAS POR AYUDA Y ESTE FORM . ES GRACIAS A ENIGMA25 TODOS LOS CREDITOS A EL"]
[null,"CLIENTE 4","DATOS X","2017-03-29",null,4,"DATOS X"]
[null,"CLIENTE 5","DATOS X","2017-03-30",null,5,"DATOS X"]
[null,"CLIENTE 6","DATOS X","2017-03-31",null,6,"DATOS X"]
[null,"CLIENTE 7","DATOS X","2017-04-01",null,6,"DATOS X"]
[null,"CLIENTE 8","DATOS X","2017-04-02",null,6,"DATOS X"]
[null,"CLIENTE 9","DATOS X","2017-04-03",null,6,"DATOS X"]
[null,"CLIENTE 10","DATOS X","2017-04-04",null,6,"DATOS X"]
[null,"CLIENTE 11","DATOS X","2017-04-05",null,6,"DATOS X"]
[null,"CLIENTE 12","DATOS X","2017-04-06",null,6,"DATOS X"]
[null,"CLIENTE 13","DATOS X","2017-04-07",null,6,"DATOS X"]
[null,"CLIENTE 14","DATOS X","2017-04-08",null,6,"DATOS X"]
[null,"CLIENTE 15","DATOS X","2017-04-09",null,6,"DATOS X",null,null,null,null,"EN LA HOJA DATOS SE ENCUENTRA EL STOCK "]
[null,"CLIENTE 16","DATOS X","2017-04-10",null,6,"DATOS X",null,null,null,null,"QUISIERA VER EL STOCK DEL PRODUCTO "]
[null,"CLIENTE 17","DATOS X","2017-04-11",null,6,"DATOS X"]
[null,"CLIENTE 18","DATOS X","2017-04-12",null,6,"DATOS X"]
[null,"CLIENTE 19","DATOS X","2017-04-13",null,6,"DATOS X"]
[null,"CLIENTE 20","DATOS X","2017-04-14",null,6,"DATOS X",null,null,null,null,"bueno si alguien le puede agregar este fondo a mi formulario estaria genial para que me ayude con la vision"]
[null,"CLIENTE 21","DATOS X","2017-04-15",null,6,"DATOS X"]
[null,"CLIENTE 22","DATOS X","2017-04-16",null,6,"DATOS X"]
[null,"CLIENTE 23","DATOS X","2017-04-17",null,6,"DATOS X"]
[null,"CLIENTE 24","DATOS X","2017-04-18",null,20,"DATOS X"]
[null,"CLIENTE 25","DATOS X","2017-04-19",null,50,"DATOS X"]
[null,"CLIENTE 26","DATOS X","2017-04-20",null,1,"DATOS X"]
[null,"CLIENTE 27","DATOS X","2017-04-21",null,2,"DATOS X"]
[null,"CLIENTE 28","DATOS X","2017-04-22",null,1200,"DATOS X"]
[null,"CLIENTE 29","DATOS X","2017-04-23",null,500,"DATOS X"]
[null,"CLIENTE 30","DATOS X","2017-04-24",null,5000,"DATOS X"]
[null,"CLIENTE 31","DATOS X","2017-04-25",null,646556,"DATOS X"]
[null,"CLIENTE 32","DATOS X","2017-04-26",null,2500,"DATOS X"]
[null,"CLIENTE 33","DATOS X","2017-04-27",null,4500,"DATOS X"]
[null,"CLIENTE 34","DATOS X","2017-04-28",null,5000,"DATOS X"]
[null,"CLIENTE 35","DATOS X","2017-04-29",null,1200,"DATOS X"]
[null,"CLIENTE 36","DATOS X","2017-04-30",null,646565,"DATOS X"]
[null,"CLIENTE 37","DATOS X","2017-05-01",null,5000,"DATOS X"]
[null,"CLIENTE 38","DATOS X","2017-05-02",null,1500,"DATOS X"]
[null,"CLIENTE 39","DATOS X","2017-05-03",null,45000,"DATOS X"]
[null,"CLIENTE 40","DATOS X","2017-05-04",null,500,"DATOS X"]
[null,"CLIENTE 41","DATOS X","2017-05-05",null,5000,"DATOS X"]
[null,"CLIENTE 42","DATOS X","2017-05-06",null,12,"DATOS X"]
[null,"CLIENTE 43","DATOS X","2017-05-07",null,500,"DATOS X"]
[null,"CLIENTE 44","DATOS X","2017-05-08",null,600,"DATOS X"]
[null,"CLIENTE 45","DATOS X","2017-05-09",null,1.2,"DATOS X"]
[null,"CLIENTE 46","DATOS X","2017-03-27",null,74993.611717171705,"DATOS X"]
[null,"CLIENTE 47","DATOS X","2017-03-27",null,76929.246815985898,"DATOS X"]
[null,"CLIENTE 48","DATOS X","2017-03-28",null,78864.881914800106,"DATOS X"]
[null,"CLIENTE 49","DATOS X","2017-03-29",null,80800.517013614401,"DATOS X"]
[null,"CLIENTE 50",null,"0079-A-100",null,5]
[null,null,"2017-10-05","1903-03-18",null,6]

{"sheet":"DATOS","index":3,"n_rows":1177,"n_cols":2,"rows_kept":1177,"cut":false,"hidden":false,"merged":[]}
["CODIGO","STOCK"]
[1,{"$f":"VLOOKUP(A2,EXISTENCIAS!B4:G1179,6,0)","v":2}]
[2,{"$f":"VLOOKUP(A3,EXISTENCIAS!B5:G1180,6,0)","v":28}]
[3,{"$f":"VLOOKUP(A4,EXISTENCIAS!B6:G1181,6,0)","v":0}]
[4,{"$f":"VLOOKUP(A5,EXISTENCIAS!B7:G1182,6,0)","v":0}]
[5,{"$f":"VLOOKUP(A6,EXISTENCIAS!B8:G1183,6,0)","v":24}]
[6,{"$f":"VLOOKUP(A7,EXISTENCIAS!B9:G1184,6,0)","v":50}]
[7,{"$f":"VLOOKUP(A8,EXISTENCIAS!B10:G1185,6,0)","v":0}]
[8,{"$f":"VLOOKUP(A9,EXISTENCIAS!B11:G1186,6,0)","v":47}]
[9,{"$f":"VLOOKUP(A10,EXISTENCIAS!B12:G1187,6,0)","v":42}]
[10,{"$f":"VLOOKUP(A11,EXISTENCIAS!B13:G1188,6,0)","v":34}]
[11,{"$f":"VLOOKUP(A12,EXISTENCIAS!B14:G1189,6,0)","v":50}]
[12,{"$f":"VLOOKUP(A13,EXISTENCIAS!B15:G1190,6,0)","v":0}]
[13,{"$f":"VLOOKUP(A14,EXISTENCIAS!B16:G1191,6,0)","v":72}]
[14,{"$f":"VLOOKUP(A15,EXISTENCIAS!B17:G1192,6,0)","v":47}]
[15,{"$f":"VLOOKUP(A16,EXISTENCIAS!B18:G1193,6,0)","v":162}]
[16,{"$f":"VLOOKUP(A17,EXISTENCIAS!B19:G1194,6,0)","v":99}]
[17,{"$f":"VLOOKUP(A18,EXISTENCIAS!B20:G1195,6,0)","v":1}]
[18,{"$f":"VLOOKUP(A19,EXISTENCIAS!B21:G1196,6,0)","v":118}]
[19,{"$f":"VLOOKUP(A20,EXISTENCIAS!B22:G1197,6,0)","v":86}]
[20,{"$f":"VLOOKUP(A21,EXISTENCIAS!B23:G1198,6,0)","v":114}]
[21,{"$f":"VLOOKUP(A22,EXISTENCIAS!B24:G1199,6,0)","v":114}]
[22,{"$f":"VLOOKUP(A23,EXISTENCIAS!B25:G1200,6,0)","v":137}]
[23,{"$f":"VLOOKUP(A24,EXISTENCIAS!B26:G1201,6,0)","v":115}]
[24,{"$f":"VLOOKUP(A25,EXISTENCIAS!B27:G1202,6,0)","v":118}]
[25,{"$f":"VLOOKUP(A26,EXISTENCIAS!B28:G1203,6,0)","v":101}]
[26,{"$f":"VLOOKUP(A27,EXISTENCIAS!B29:G1204,6,0)","v":133}]
[27,{"$f":"VLOOKUP(A28,EXISTENCIAS!B30:G1205,6,0)","v":124}]
[28,{"$f":"VLOOKUP(A29,EXISTENCIAS!B31:G1206,6,0)","v":158}]
[29,{"$f":"VLOOKUP(A30,EXISTENCIAS!B32:G1207,6,0)","v":146}]
[30,{"$f":"VLOOKUP(A31,EXISTENCIAS!B33:G1208,6,0)","v":109}]
[31,{"$f":"VLOOKUP(A32,EXISTENCIAS!B34:G1209,6,0)","v":62}]
[32,{"$f":"VLOOKUP(A33,EXISTENCIAS!B35:G1210,6,0)","v":62}]
[33,{"$f":"VLOOKUP(A34,EXISTENCIAS!B36:G1211,6,0)","v":92}]
[34,{"$f":"VLOOKUP(A35,EXISTENCIAS!B37:G1212,6,0)","v":34}]
[35,{"$f":"VLOOKUP(A36,EXISTENCIAS!B38:G1213,6,0)","v":58}]
[36,{"$f":"VLOOKUP(A37,EXISTENCIAS!B39:G1214,6,0)","v":31}]
[37,{"$f":"VLOOKUP(A38,EXISTENCIAS!B40:G1215,6,0)","v":29}]
[38,{"$f":"VLOOKUP(A39,EXISTENCIAS!B41:G1216,6,0)","v":37}]
[39,{"$f":"VLOOKUP(A40,EXISTENCIAS!B42:G1217,6,0)","v":110}]
[40,{"$f":"VLOOKUP(A41,EXISTENCIAS!B43:G1218,6,0)","v":23}]
[41,{"$f":"VLOOKUP(A42,EXISTENCIAS!B44:G1219,6,0)","v":1}]
[42,{"$f":"VLOOKUP(A43,EXISTENCIAS!B45:G1220,6,0)","v":52}]
[43,{"$f":"VLOOKUP(A44,EXISTENCIAS!B46:G1221,6,0)","v":42}]
[44,{"$f":"VLOOKUP(A45,EXISTENCIAS!B47:G1222,6,0)","v":60}]
[45,{"$f":"VLOOKUP(A46,EXISTENCIAS!B48:G1223,6,0)","v":42}]
[46,{"$f":"VLOOKUP(A47,EXISTENCIAS!B49:G1224,6,0)","v":49}]
[47,{"$f":"VLOOKUP(A48,EXISTENCIAS!B50:G1225,6,0)","v":30}]
[48,{"$f":"VLOOKUP(A49,EXISTENCIAS!B51:G1226,6,0)","v":21}]
[49,{"$f":"VLOOKUP(A50,EXISTENCIAS!B52:G1227,6,0)","v":51}]
[50,{"$f":"VLOOKUP(A51,EXISTENCIAS!B53:G1228,6,0)","v":39}]
[51,{"$f":"VLOOKUP(A52,EXISTENCIAS!B54:G1229,6,0)","v":30}]
[52,{"$f":"VLOOKUP(A53,EXISTENCIAS!B55:G1230,6,0)","v":28}]
[53,{"$f":"VLOOKUP(A54,EXISTENCIAS!B56:G1231,6,0)","v":30}]
[54,{"$f":"VLOOKUP(A55,EXISTENCIAS!B57:G1232,6,0)","v":32}]
[55,{"$f":"VLOOKUP(A56,EXISTENCIAS!B58:G1233,6,0)","v":69}]
[56,{"$f":"VLOOKUP(A57,EXISTENCIAS!B59:G1234,6,0)","v":65}]
[57,{"$f":"VLOOKUP(A58,EXISTENCIAS!B60:G1235,6,0)","v":118}]
[58,{"$f":"VLOOKUP(A59,EXISTENCIAS!B61:G1236,6,0)","v":7}]
[59,{"$f":"VLOOKUP(A60,EXISTENCIAS!B62:G1237,6,0)","v":25}]
[60,{"$f":"VLOOKUP(A61,EXISTENCIAS!B63:G1238,6,0)","v":63}]
[61,{"$f":"VLOOKUP(A62,EXISTENCIAS!B64:G1239,6,0)","v":6}]
[62,{"$f":"VLOOKUP(A63,EXISTENCIAS!B65:G1240,6,0)","v":17}]
[63,{"$f":"VLOOKUP(A64,EXISTENCIAS!B66:G1241,6,0)","v":7}]
[64,{"$f":"VLOOKUP(A65,EXISTENCIAS!B67:G1242,6,0)","v":30}]
[65,{"$f":"VLOOKUP(A66,EXISTENCIAS!B68:G1243,6,0)","v":11}]
[66,{"$f":"VLOOKUP(A67,EXISTENCIAS!B69:G1244,6,0)","v":13}]
[67,{"$f":"VLOOKUP(A68,EXISTENCIAS!B70:G1245,6,0)","v":16}]
[68,{"$f":"VLOOKUP(A69,EXISTENCIAS!B71:G1246,6,0)","v":15}]
[69,{"$f":"VLOOKUP(A70,EXISTENCIAS!B72:G1247,6,0)","v":6}]
[70,{"$f":"VLOOKUP(A71,EXISTENCIAS!B73:G1248,6,0)","v":31}]
[71,{"$f":"VLOOKUP(A72,EXISTENCIAS!B74:G1249,6,0)","v":0}]
[72,{"$f":"VLOOKUP(A73,EXISTENCIAS!B75:G1250,6,0)","v":0}]
[73,{"$f":"VLOOKUP(A74,EXISTENCIAS!B76:G1251,6,0)","v":51}]
[74,{"$f":"VLOOKUP(A75,EXISTENCIAS!B77:G1252,6,0)","v":0}]
[75,{"$f":"VLOOKUP(A76,EXISTENCIAS!B78:G1253,6,0)","v":0}]
[76,{"$f":"VLOOKUP(A77,EXISTENCIAS!B79:G1254,6,0)","v":0}]
[77,{"$f":"VLOOKUP(A78,EXISTENCIAS!B80:G1255,6,0)","v":0}]
[78,{"$f":"VLOOKUP(A79,EXISTENCIAS!B81:G1256,6,0)","v":0}]
[79,{"$f":"VLOOKUP(A80,EXISTENCIAS!B82:G1257,6,0)","v":0}]
[80,{"$f":"VLOOKUP(A81,EXISTENCIAS!B83:G1258,6,0)","v":0}]
[81,{"$f":"VLOOKUP(A82,EXISTENCIAS!B84:G1259,6,0)","v":0}]
[82,{"$f":"VLOOKUP(A83,EXISTENCIAS!B85:G1260,6,0)","v":23}]
[83,{"$f":"VLOOKUP(A84,EXISTENCIAS!B86:G1261,6,0)","v":10}]
[84,{"$f":"VLOOKUP(A85,EXISTENCIAS!B87:G1262,6,0)","v":0}]
[85,{"$f":"VLOOKUP(A86,EXISTENCIAS!B88:G1263,6,0)","v":6}]
[86,{"$f":"VLOOKUP(A87,EXISTENCIAS!B89:G1264,6,0)","v":0}]
[87,{"$f":"VLOOKUP(A88,EXISTENCIAS!B90:G1265,6,0)","v":0}]
[88,{"$f":"VLOOKUP(A89,EXISTENCIAS!B91:G1266,6,0)","v":14}]
[89,{"$f":"VLOOKUP(A90,EXISTENCIAS!B92:G1267,6,0)","v":16}]
[90,{"$f":"VLOOKUP(A91,EXISTENCIAS!B93:G1268,6,0)","v":10}]
[91,{"$f":"VLOOKUP(A92,EXISTENCIAS!B94:G1269,6,0)","v":24}]
[92,{"$f":"VLOOKUP(A93,EXISTENCIAS!B95:G1270,6,0)","v":0}]
[93,{"$f":"VLOOKUP(A94,EXISTENCIAS!B96:G1271,6,0)","v":8}]
[94,{"$f":"VLOOKUP(A95,EXISTENCIAS!B97:G1272,6,0)","v":0}]
[95,{"$f":"VLOOKUP(A96,EXISTENCIAS!B98:G1273,6,0)","v":26}]
[96,{"$f":"VLOOKUP(A97,EXISTENCIAS!B99:G1274,6,0)","v":17}]
[97,{"$f":"VLOOKUP(A98,EXISTENCIAS!B100:G1275,6,0)","v":0}]
[98,{"$f":"VLOOKUP(A99,EXISTENCIAS!B101:G1276,6,0)","v":26}]
[99,{"$f":"VLOOKUP(A100,EXISTENCIAS!B102:G1277,6,0)","v":11}]
[100,{"$f":"VLOOKUP(A101,EXISTENCIAS!B103:G1278,6,0)","v":23}]
[101,{"$f":"VLOOKUP(A102,EXISTENCIAS!B104:G1279,6,0)","v":47}]
[102,{"$f":"VLOOKUP(A103,EXISTENCIAS!B105:G1280,6,0)","v":53}]
[103,{"$f":"VLOOKUP(A104,EXISTENCIAS!B106:G1281,6,0)","v":46}]
[104,{"$f":"VLOOKUP(A105,EXISTENCIAS!B107:G1282,6,0)","v":34}]
[105,{"$f":"VLOOKUP(A106,EXISTENCIAS!B108:G1283,6,0)","v":20}]
[106,{"$f":"VLOOKUP(A107,EXISTENCIAS!B109:G1284,6,0)","v":49}]
[107,{"$f":"VLOOKUP(A108,EXISTENCIAS!B110:G1285,6,0)","v":19}]
[108,{"$f":"VLOOKUP(A109,EXISTENCIAS!B111:G1286,6,0)","v":29}]
[109,{"$f":"VLOOKUP(A110,EXISTENCIAS!B112:G1287,6,0)","v":6}]
[110,{"$f":"VLOOKUP(A111,EXISTENCIAS!B113:G1288,6,0)","v":0}]
[111,{"$f":"VLOOKUP(A112,EXISTENCIAS!B114:G1289,6,0)","v":80}]
[112,{"$f":"VLOOKUP(A113,EXISTENCIAS!B115:G1290,6,0)","v":78}]
[113,{"$f":"VLOOKUP(A114,EXISTENCIAS!B116:G1291,6,0)","v":71}]
[114,{"$f":"VLOOKUP(A115,EXISTENCIAS!B117:G1292,6,0)","v":0}]
[115,{"$f":"VLOOKUP(A116,EXISTENCIAS!B118:G1293,6,0)","v":17}]
[116,{"$f":"VLOOKUP(A117,EXISTENCIAS!B119:G1294,6,0)","v":25}]
[117,{"$f":"VLOOKUP(A118,EXISTENCIAS!B120:G1295,6,0)","v":68}]
[118,{"$f":"VLOOKUP(A119,EXISTENCIAS!B121:G1296,6,0)","v":24}]
[119,{"$f":"VLOOKUP(A120,EXISTENCIAS!B122:G1297,6,0)","v":10}]
{"$rows_left_out":1057}